{"text_format":"1","workbook":"xlsx","n_sheets":31,"sheets":["Project Management Main","CHECKLISTS ---->","Planning Task List","Schematic Design Task List","Design Development Task List","Construction Document Task List","Bidding Task List","Pre-construction Task List","Construction Task List","Close-out Task List","PROCESS MAPS ---->","CP Delivery Phases","Planning Process","Schematic Design Process","Design Development Process","Construction Docs Process","Bidding Process","Pre-Construction Process","Construction Process","Closeout Process","PM TOOLS---->","Project Status Reports","Project Planning Partners List","Issues Log","Deviations Log","Project A3","Team Contact List","Drop-down lists","CODING --->","THIS_CP","ACTIVE_CPS"],"not_rendered":{"charts":0,"images":8,"macros":1,"external_links":0,"defined_names":32,"comments":0,"pivot_tables":0},"unopened":[],"bounds":{"document_bytes":16777216,"sheet_cells":100000,"rows_first":2000,"rows_last":500,"rows_between":2000,"halvings":0,"cell_chars":16384,"cell_head_chars":4096},"cells_cut":0,"cells_raw":0,"read":"whole","date_system":"1900"}

{"sheet":"Project Management Main","index":0,"n_rows":44,"n_cols":14,"rows_kept":44,"cut":false,"hidden":false,"merged":[[22,13,24,13],[41,13,41,14],[42,13,42,14],[43,13,43,14],[36,12,36,14],[37,12,37,14],[38,12,38,14],[39,12,39,14],[40,13,40,14],[31,12,31,14],[32,12,32,14],[33,12,33,14],[34,12,34,14],[35,12,35,14],[39,2,39,4],[39,6,39,10],[33,2,33,4],[25,2,25,4],[29,6,29,10],[28,2,28,4],[27,2,27,4],[43,6,43,10],[9,9,10,9],[6,2,6,10],[26,2,26,4],[6,12,6,14],[24,2,24,4],[23,2,23,4],[13,2,13,4],[13,6,13,10],[8,7,8,8],[10,3,10,8],[20,12,20,14],[21,2,21,4],[22,2,22,4],[24,6,24,10],[29,12,29,14]]}
[]
[]
[]
[]
[]
[]
[null,null,"Project Information",null,null,null,null,null,null,null,null,null,"Internal Team"]
[]
{"$rows_left_out":37}
{"sheet":"CHECKLISTS ---->","index":1,"n_rows":12,"n_cols":4,"rows_kept":12,"cut":false,"hidden":false,"merged":[]}
[]
[]
[]
[]
[]
[]
[]
[]
{"$rows_left_out":5}
{"sheet":"Planning Task List","index":2,"n_rows":97,"n_cols":7,"rows_kept":97,"cut":false,"hidden":false,"merged":[[2,5,2,6],[3,5,3,6],[84,0,96,0],[5,0,9,0],[13,0,40,0],[42,0,57,0],[71,0,82,0],[59,0,69,0]]}
[]
[{"$f":"\"Project Number: \" &proj_id","v":"Project Number: "}]
[{"$f":"\"Project Name: \" &proj_nm","v":{"$error":"#N/A"}},null,null,null,null,"Planning - Detailed Task List"]
[null,null,null,null,null,"Planning Process Flowchart"]
["Milestone","Item","Description","Status","Assignee","Due Date or Completion Date","Notes and Resources"]
["Verify initial project information","P1","Account number identified in FAMIS Accounts tab"]
[null,"P2","Funding source for project account number"]
[null,"P3","Proof of project approval"]
{"$rows_left_out":90}
{"sheet":"Schematic Design Task List","index":3,"n_rows":188,"n_cols":11,"rows_kept":188,"cut":false,"hidden":false,"merged":[[14,0,25,0],[54,0,63,0],[65,0,75,0],[2,5,2,6],[3,5,3,6],[5,0,12,0],[41,0,52,0],[178,0,187,0],[146,0,148,0],[150,0,154,0],[156,0,163,0],[165,0,171,0],[173,0,176,0],[77,0,88,0],[129,0,144,0],[108,0,127,0],[90,0,100,0],[27,0,39,0],[102,0,106,0]]}
[]
[{"$f":"\"Project Number: \" &proj_id","v":"Project Number: "}]
[{"$f":"\"Project Name: \" &proj_nm","v":{"$error":"#N/A"}},null,null,null,null,"Schematic Design - Detailed Task List"]
[null,null,null,null,null,"SD Process Flowchart"]
["Milestone","Item","Description","Status","Assignee","Due Date or Completion Date","Notes"]
["Procurement Strategy - Consultant / Construction Manager","SD1","Determine source of design services - in-house or Consultant",null,null,null,null,null,null,null,"Status Drop-down"]
[null,"SD2","Determine project delivery method",null,null,null,null,null,null,null,"Status Drop-down"]
[null,"SD3","Options: General Contractor or Design Bid & Build (GC), Construction Manager(CM), Internal Construction Manager (ICM), Integrated Project Delivery (IPD), IPF Self-performed (IPF) or To Be Determined (TBD)"]
{"$rows_left_out":181}
{"sheet":"Design Development Task List","index":4,"n_rows":94,"n_cols":7,"rows_kept":94,"cut":false,"hidden":false,"merged":[[2,5,2,6],[3,5,3,6],[75,0,80,0],[82,0,93,0],[47,0,68,0],[5,0,12,0],[14,0,45,0],[70,0,73,0]]}
[]
[{"$f":"\"Project Number: \" &proj_id","v":"Project Number: "}]
[{"$f":"\"Project Name: \" &proj_nm","v":{"$error":"#N/A"}},null,null,null,null,"Design Development - Detailed Task List"]
[null,null,null,null,null,"DD Process Flowchart"]
["Milestone","Item","Description","Status","Assignee","Due Date or Completion Date","Notes"]
["Design Development Progress Meeting with Customer","DD1","Schedule design development progress meeting with Customer"]
[null,"DD2","Include Consultant"]
[null,"DD3","Include Construction Manager"]
{"$rows_left_out":87}
{"sheet":"Construction Document Task List","index":5,"n_rows":89,"n_cols":7,"rows_kept":89,"cut":false,"hidden":false,"merged":[[2,5,2,6],[3,5,3,6],[74,0,88,0],[5,0,12,0],[14,0,42,0],[44,0,61,0],[63,0,65,0],[67,0,72,0]]}
[]
[{"$f":"\"Project Number: \" &proj_id","v":"Project Number: "}]
[{"$f":"\"Project Name: \" &proj_nm","v":{"$error":"#N/A"}},null,null,null,null,"Construction Documents - Detailed Task List"]
[null,null,null,null,null,"CD Process Flowchart"]
["Milestone","Item","Description","Status","Assignee","Due Date or Completion Date","Notes"]
["Construction Documents Progress Meeting with Customer","CD1","Schedule construction documents progress meeting with Customer"]
[null,"CD2","Include Consultant"]
[null,"CD3","Include Construction Manager"]
{"$rows_left_out":82}
{"sheet":"Bidding Task List","index":6,"n_rows":79,"n_cols":7,"rows_kept":79,"cut":false,"hidden":false,"merged":[[58,0,70,0],[72,0,78,0],[27,0,30,0],[2,5,2,6],[3,5,3,6],[32,0,42,0],[5,0,25,0],[44,0,56,0]]}
[]
[{"$f":"\"Project Number: \" &proj_id","v":"Project Number: "}]
[{"$f":"\"Project Name: \" &proj_nm","v":{"$error":"#N/A"}},null,null,null,null,"Bidding Phase - Detailed Task List"]
[null,null,null,null,null,"Bidding Process Flowchart"]
["Milestone","Item","Description","Status","Assignee","Due Date or Completion Date","Notes"]
["Manage Bidding - General Contractor (GC)","B1","Compile bid documents, including specifications and drawings",null,null,null,"Instructions for Formatting Project Specifications"]
[null,"B2","Request 100% complete bid set of drawings and specifications from the Consultant (or combine documents from in-house design team members)"]
[null,"B3","Obtain electronic set of bid documents from consultant"]
{"$rows_left_out":72}
{"sheet":"Pre-construction Task List","index":7,"n_rows":61,"n_cols":7,"rows_kept":61,"cut":false,"hidden":false,"merged":[[2,5,2,6],[3,5,3,6],[8,0,14,0],[16,0,29,0],[57,0,60,0],[31,0,33,0],[35,0,39,0],[41,0,54,0],[5,0,6,0]]}
[]
[{"$f":"\"Project Number: \" &proj_id","v":"Project Number: "}]
[{"$f":"\"Project Name: \" &proj_nm","v":{"$error":"#N/A"}},null,null,null,null,"Pre-construction Phase - Detailed Task List"]
[]
["Milestone","Item","Description","Status","Assignee","Due Date or Completion Date","Notes"]
["Contracts","PC1","Issue Letter of Intent if needed to expedite non-construction activities",null,null,null,"Letter of Intent (template)"]
[null,"PC2","Ensure bonds, insurance and contract are ALL in place prior to mobilization of contractor on site",null,null,null,"Insurance (instructions)"]
[]
{"$rows_left_out":54}
{"sheet":"Construction Task List","index":8,"n_rows":65,"n_cols":7,"rows_kept":65,"cut":false,"hidden":false,"merged":[[2,5,2,6],[3,5,3,6],[48,0,64,0],[35,0,46,0],[5,0,9,0],[11,0,19,0],[21,0,27,0],[29,0,33,0]]}
[]
[{"$f":"\"Project Number: \" &proj_id","v":"Project Number: "}]
[{"$f":"\"Project Name: \" &proj_nm","v":{"$error":"#N/A"}},null,null,null,null,"Construction Phase - Detailed Task List"]
[]
["Milestone","Item","Description","Status","Assignee","Due Date or Completion Date","Notes"]
["Construction Phase Communications","C1","Issue utility shutdown notice(s)",null,null,null,"Notice - Utility Shutdown (template)"]
[null,"C2","Prepare and distribute construction status reports",null,null,null,"Customer Status Report"]
[null,"C3","Review Requests for Information (RFI) log",null,null,null,"RFI (process)"]
{"$rows_left_out":58}
{"sheet":"Close-out Task List","index":9,"n_rows":38,"n_cols":7,"rows_kept":38,"cut":false,"hidden":false,"merged":[[2,5,2,6],[3,5,3,6],[35,0,37,0],[31,0,33,0],[5,0,8,0],[10,0,15,0],[17,0,21,0],[23,0,25,0],[27,0,29,0]]}
[]
[{"$f":"\"Project Number: \" &proj_id","v":"Project Number: "}]
[{"$f":"\"Project Name: \" &proj_nm","v":{"$error":"#N/A"}},null,null,null,null,"Close-out Phase - Detailed Task List"]
[]
["Milestone","Item","Description","Status","Assignee","Due Date or Completion Date","Notes"]
["Close-out Phase Contracts","CO1","Receive as-built drawings - forward to internal team members for review",null,null,null,"Project Close-out (procedure)"]
[null,"CO2","Receive operation and maintenance manuals - forward to internal team members for review",null,null,null,"Project Close-out (procedure)"]
[null,"CO3","Receive certificate of substantial completion if required",null,null,null,"Certificate of Substantial Completion (process)"]
{"$rows_left_out":31}
{"sheet":"PROCESS MAPS ---->","index":10,"n_rows":13,"n_cols":4,"rows_kept":13,"cut":false,"hidden":false,"merged":[]}
[]
[]
[]
[]
[]
[]
[]
[]
{"$rows_left_out":6}
{"sheet":"CP Delivery Phases","index":11,"n_rows":2,"n_cols":4,"rows_kept":2,"cut":false,"hidden":false,"merged":[]}
[]
[null,null,null,"Capital Project Delivery Process"]

{"sheet":"Planning Process","index":12,"n_rows":3,"n_cols":16,"rows_kept":3,"cut":false,"hidden":false,"merged":[[2,15,2,16]]}
[]
[null,null,null,null,"Planning Phase - Process with Milestones"]
[null,null,null,null,null,null,null,null,null,null,null,null,null,null,null,"Planning Task List"]

{"sheet":"Schematic Design Process","index":13,"n_rows":2,"n_cols":16,"rows_kept":2,"cut":false,"hidden":false,"merged":[]}
[]
[null,"Schematic Design (SD) Phase - Process with Milestones",null,null,null,null,null,null,null,null,null,null,null,null,null,"SD Task List"]

{"sheet":"Design Development Process","index":14,"n_rows":3,"n_cols":16,"rows_kept":3,"cut":false,"hidden":false,"merged":[]}
[]
[null,"Design Development (DD) Phase - Process with Milestones"]
[null,null,null,null,null,null,null,null,null,null,null,null,null,null,null,"DD Task List"]

{"sheet":"Construction Docs Process","index":15,"n_rows":4,"n_cols":16,"rows_kept":4,"cut":false,"hidden":false,"merged":[]}
[]
[null,"Construction Documents (CD) Phase - Process with Milestones"]
[]
[null,null,null,null,null,null,null,null,null,null,null,null,null,null,null,"CD Task List"]

{"sheet":"Bidding Process","index":16,"n_rows":2,"n_cols":15,"rows_kept":2,"cut":false,"hidden":false,"merged":[]}
[]
[null,"Bidding Phase - Process with Milestones",null,null,null,null,null,null,null,null,null,null,null,null,"Bidding Task List"]

{"sheet":"Pre-Construction Process","index":17,"n_rows":6,"n_cols":15,"rows_kept":6,"cut":false,"hidden":false,"merged":[]}
[]
[null,"Pre-Construction Phase - Process with Milestones",null,null,null,null,null,null,null,null,null,null,null,null,"Pre-construction Task List"]
[]
[]
[]
[null,"Flowchart is under construction"]

{"sheet":"Construction Process","index":18,"n_rows":7,"n_cols":15,"rows_kept":7,"cut":false,"hidden":false,"merged":[]}
[]
[null,"Construction Phase - Process with Milestones",null,null,null,null,null,null,null,null,null,null,null,null,"Construction Task List"]
[]
[]
[]
[]
[null,"Flowchart is under construction"]

{"sheet":"Closeout Process","index":19,"n_rows":6,"n_cols":15,"rows_kept":6,"cut":false,"hidden":false,"merged":[]}
[]
[null,"Closeout Phase - Process with Milestones",null,null,null,null,null,null,null,null,null,null,null,null,"Close-out Task List"]
[]
[]
[]
[null,"Flowchart is under construction"]

{"sheet":"PM TOOLS---->","index":20,"n_rows":13,"n_cols":4,"rows_kept":13,"cut":false,"hidden":false,"merged":[]}
[]
[]
[]
[]
[]
[]
[]
[]
{"$rows_left_out":6}
{"sheet":"Project Status Reports","index":21,"n_rows":21,"n_cols":2,"rows_kept":21,"cut":false,"hidden":false,"merged":[[6,0,6,2]]}
[]
[{"$f":"\"Project Number: \" &proj_id","v":"Project Number: "},"Project Status Reports"]
[{"$f":"\"Project Name: \" &proj_nm","v":{"$error":"#N/A"}}]
[]
[]
[]
["Customer Construction Report"]
["Username: IPFUser, Password: IPFUser123$"]
{"$rows_left_out":14}
{"sheet":"Project Planning Partners List","index":22,"n_rows":99,"n_cols":9,"rows_kept":99,"cut":false,"hidden":false,"merged":[]}
[{"$f":"\"Project Number: \" &proj_id","v":"Project Number: "}]
[{"$f":"\"Project Name: \" &proj_nm","v":{"$error":"#N/A"}}]
[null,null,null,"Project Planning Partners List"]
["S E R V I C E","O F F I C E","Supervisor and/or Alternate","Design and Construction Notes","On the Team?","P R I M A R Y                      C O N T A C T","Office Phone","E-mail Address","GROUP"]
["Accessibility ","Resource Center for Persons with Disabilities","Mike Hudson",null,null,"Virginia Martz","353-9642  355-1293","martzvir@msu.edu","MSU"]
["Air Handlers & Boilers","Project Services","Shawn Kelly",null,null,"Mike Bingham","884-3631","mbingham@ipf.msu.edu","IPF"]
["Alterations & Improvements","Maintenance Services","Mark Lutkenhoff",null,null,"Mark Lutkenhoff","432-0537","mlutkenhoff@ipf.msu.edu","IPF"]
["Archeology - project excavation","Anthropology Social Science",null,null,null,"Lynne Goldstein","353-4704","lynneg@msu.edu","MSU"]
{"$rows_left_out":92}
{"sheet":"Issues Log","index":23,"n_rows":40,"n_cols":10,"rows_kept":40,"cut":false,"hidden":false,"merged":[]}
[]
[{"$f":"\"Project Number: \" &proj_id","v":"Project Number: "}]
[{"$f":"\"Project Name: \" &proj_nm","v":{"$error":"#N/A"}},null,null,null,null,null,"Issues Log"]
[]
[]
["Issue #","Entry Date","Entered By","Category (S=Scope, B=Budget, S=Schedule, O=Other)","Issue Description","Priority (H, M, L)","Action Manager","Target Resolution Date","Status (U=Unassigned, A=Assigned, C=Closed)","Description of Action Taken"]
[1]
[2]
{"$rows_left_out":33}
{"sheet":"Deviations Log","index":24,"n_rows":42,"n_cols":9,"rows_kept":42,"cut":false,"hidden":false,"merged":[[4,0,4,1],[8,1,8,2],[8,6,8,8],[6,0,6,4],[5,4,5,8],[5,0,5,3]]}
[]
[{"$f":"\"Project Number: \" &proj_id","v":"Project Number: "}]
[{"$f":"\"Project Name: \" &proj_nm","v":{"$error":"#N/A"}},null,null,null,null,null,"Deviations Log"]
[]
["<Current Date of Log>"]
["<Description and date of document set, ex: Bid Documents>",null,null,null,"Does the project deviate from MSU standards?  _______No    ________Yes, see below"]
["<CONSULTANT NAME> PROJECT NO:  XXX"]
[]
{"$rows_left_out":35}
{"sheet":"Project A3","index":25,"n_rows":47,"n_cols":10,"rows_kept":47,"cut":false,"hidden":false,"merged":[[45,8,52,9],[7,3,18,3],[20,3,31,3],[33,3,44,3],[1,5,1,9]]}
[]
[null,null,null,"Report Date:",null,{"$f":"proj_nm","v":{"$error":"#N/A"}}]
[null,null,null,{"$f":"TODAY()","v":"2019-12-12"},null,{"$f":"proj_id","v":0}]
[]
[]
[]
[]
[null,"Program Needs",null,null,null,"Dept/Name","E-mail",null,"Milestone","Date(s)"]
{"$rows_left_out":40}
{"sheet":"Team Contact List","index":26,"n_rows":6,"n_cols":6,"rows_kept":6,"cut":false,"hidden":false,"merged":[]}
[]
[{"$f":"\"Project Number: \" &proj_id","v":"Project Number: "}]
[{"$f":"\"Project Name: \" &proj_nm","v":{"$error":"#N/A"}},null,null,null,null,"Team Contact List"]
[]
[]
["Name","Role","Company","Office Phone","Cell Phone","E-mail Address"]

{"sheet":"Drop-down lists","index":27,"n_rows":5,"n_cols":1,"rows_kept":5,"cut":false,"hidden":true,"merged":[]}
[]
["Not Started"]
["In Progress"]
["Complete"]
["NA"]

{"sheet":"CODING --->","index":28,"n_rows":0,"n_cols":0,"rows_kept":0,"cut":false,"hidden":false,"merged":[]}

{"sheet":"THIS_CP","index":29,"n_rows":2,"n_cols":40,"rows_kept":2,"cut":false,"hidden":false,"merged":[]}
["CP  NO","DESCRIPTION","STATUS","PROJ MGR","CUSTOMER","ARCH","INT DES","LANDSC ARCH","CIVIL ENG","MECH ENG","ELEC ENG","CONST REP","PROJ ADMIN","CONSULTANT","CONSTRUCTOR","DELIVERY METHOD","EST COST","PLANNED_TOTAL","ACTUAL_TOTAL","PLANNED_PLANNING_START","PLANNED_PLANNING_END","PLANNING_PERCENT_COMPLETE","PLANNED_ESTIMATE_START","PLANNED_ESTIMATE_END","ESTIMATE_PERCENT_COMPLETE","PLANNED_DESIGN_START","PLANNED_DESIGN_END","DESIGN_PERCENT_COMPLETE","PLANNED_BID_START","PLANNED_BID_END","BID_PERCENT_COMPLETE","PLANNED_CONSTRUCTION_START","PLANNED_CONSTRUCTION_END","CONSTRUCTION_PERCENT_COMPLETE","PLANNED_OCCUPANCY_START","PLANNED_OCCUPANCY_END","OCCUPANCY_PERCENT_COMPLETE","PLANNED_CLOSED_START","PLANNED_CLOSED_END","CLOSED_PERCENT_COMPLETE"]
[{"$f":"proj_id","v":0},{"$f":"VLOOKUP(proj_id,ACTIVE_CPS!1:1048576,COLUMN(ACTIVE_CPS!B:B),0)","v":{"$error":"#N/A"}},{"$f":"VLOOKUP(proj_id,ACTIVE_CPS!1:1048576,COLUMN(ACTIVE_CPS!C:C),0)","v":{"$error":"#N/A"}},{"$f":"VLOOKUP(proj_id,ACTIVE_CPS!1:1048576,COLUMN(ACTIVE_CPS!AB:AB),0)","v":{"$error":"#N/A"}},{"$f":"VLOOKUP(proj_id,ACTIVE_CPS!1:1048576,COLUMN(ACTIVE_CPS!AC:AC),0)","v":{"$error":"#N/A"}},{"$f":"VLOOKUP(proj_id,ACTIVE_CPS!1:1048576,COLUMN(ACTIVE_CPS!AD:AD),0)","v":{"$error":"#N/A"}},{"$f":"VLOOKUP(proj_id,ACTIVE_CPS!1:1048576,COLUMN(ACTIVE_CPS!AE:AE),0)","v":{"$error":"#N/A"}},{"$f":"VLOOKUP(proj_id,ACTIVE_CPS!1:1048576,COLUMN(ACTIVE_CPS!AF:AF),0)","v":{"$error":"#N/A"}},{"$f":"VLOOKUP(proj_id,ACTIVE_CPS!1:1048576,COLUMN(ACTIVE_CPS!AG:AG),0)","v":{"$error":"#N/A"}},{"$f":"VLOOKUP(proj_id,ACTIVE_CPS!1:1048576,COLUMN(ACTIVE_CPS!AH:AH),0)","v":{"$error":"#N/A"}},{"$f":"VLOOKUP(proj_id,ACTIVE_CPS!1:1048576,COLUMN(ACTIVE_CPS!AI:AIB),0)","v":{"$error":"#N/A"}},{"$f":"VLOOKUP(proj_id,ACTIVE_CPS!1:1048576,COLUMN(ACTIVE_CPS!AJ:AJ),0)","v":{"$error":"#N/A"}},{"$f":"VLOOKUP(proj_id,ACTIVE_CPS!1:1048576,COLUMN(ACTIVE_CPS!AK:AK),0)","v":{"$error":"#N/A"}},{"$f":"VLOOKUP(proj_id,ACTIVE_CPS!1:1048576,COLUMN(Table_ExternalData_1[CONSULTANT]),0)","v":{"$error":"#N/A"}},{"$f":"VLOOKUP(proj_id,ACTIVE_CPS!1:1048576,COLUMN(ACTIVE_CPS!AM:AM),0)","v":{"$error":"#N/A"}},{"$f":"VLOOKUP(proj_id,ACTIVE_CPS!1:1048576,COLUMN(ACTIVE_CPS!AN:AN),0)","v":{"$error":"#N/A"}},{"$f":"VLOOKUP(proj_id,ACTIVE_CPS!1:1048576,COLUMN(ACTIVE_CPS!D:D),0)","v":{"$error":"#N/A"}},{"$f":"VLOOKUP(proj_id,ACTIVE_CPS!1:1048576,COLUMN(ACTIVE_CPS!E:E),0)","v":{"$error":"#N/A"}},{"$f":"VLOOKUP(proj_id,ACTIVE_CPS!1:1048576,COLUMN(ACTIVE_CPS!F:F),0)","v":{"$error":"#N/A"}},{"$f":"IF(VLOOKUP(proj_id,ACTIVE_CPS!1:1048576,COLUMN(ACTIVE_CPS!G:G),0) = \"\", \"\", VLOOKUP(proj_id,ACTIVE_CPS!1:1048576,COLUMN(ACTIVE_CPS!G:G),0) )","v":{"$error":"#N/A"}},{"$f":"IF(VLOOKUP(proj_id,ACTIVE_CPS!1:1048576,COLUMN(ACTIVE_CPS!H:H),0) = \"\", \"\", VLOOKUP(proj_id,ACTIVE_CPS!1:1048576,COLUMN(ACTIVE_CPS!H:H),0) )","v":{"$error":"#N/A"}},{"$f":"VLOOKUP(proj_id,ACTIVE_CPS!1:1048576,COLUMN(ACTIVE_CPS!I:I),0)","v":{"$error":"#N/A"}},{"$f":"IF(VLOOKUP(proj_id,ACTIVE_CPS!1:1048576,COLUMN(ACTIVE_CPS!J:J),0) = \"\", \"\", VLOOKUP(proj_id,ACTIVE_CPS!1:1048576,COLUMN(ACTIVE_CPS!J:J),0) )","v":{"$error":"#N/A"}},{"$f":"IF(VLOOKUP(proj_id,ACTIVE_CPS!1:1048576,COLUMN(ACTIVE_CPS!K:K),0) = \"\", \"\", VLOOKUP(proj_id,ACTIVE_CPS!1:1048576,COLUMN(ACTIVE_CPS!K:K),0) )","v":{"$error":"#N/A"}},{"$f":"VLOOKUP(proj_id,ACTIVE_CPS!1:1048576,COLUMN(ACTIVE_CPS!L:L),0)","v":{"$error":"#N/A"}},{"$f":"IF(VLOOKUP(proj_id,ACTIVE_CPS!1:1048576,COLUMN(ACTIVE_CPS!M:M),0) = \"\", \"\", VLOOKUP(proj_id,ACTIVE_CPS!1:1048576,COLUMN(ACTIVE_CPS!M:M),0) )","v":{"$error":"#N/A"}},{"$f":"IF(VLOOKUP(proj_id,ACTIVE_CPS!1:1048576,COLUMN(ACTIVE_CPS!N:N),0) = \"\", \"\", VLOOKUP(proj_id,ACTIVE_CPS!1:1048576,COLUMN(ACTIVE_CPS!N:N),0) )","v":{"$error":"#N/A"}},{"$f":"VLOOKUP(proj_id,ACTIVE_CPS!1:1048576,COLUMN(ACTIVE_CPS!O:O),0)","v":{"$error":"#N/A"}},{"$f":"IF(VLOOKUP(proj_id,ACTIVE_CPS!1:1048576,COLUMN(ACTIVE_CPS!P:P),0) = \"\", \"\", VLOOKUP(proj_id,ACTIVE_CPS!1:1048576,COLUMN(ACTIVE_CPS!P:P),0) )","v":{"$error":"#N/A"}},{"$f":"IF(VLOOKUP(proj_id,ACTIVE_CPS!1:1048576,COLUMN(ACTIVE_CPS!Q:Q),0) = \"\", \"\", VLOOKUP(proj_id,ACTIVE_CPS!1:1048576,COLUMN(ACTIVE_CPS!Q:Q),0) )","v":{"$error":"#N/A"}},{"$f":"VLOOKUP(proj_id,ACTIVE_CPS!1:1048576,COLUMN(ACTIVE_CPS!R:R),0)","v":{"$error":"#N/A"}},{"$f":"IF(VLOOKUP(proj_id,ACTIVE_CPS!1:1048576,COLUMN(ACTIVE_CPS!S:S),0) = \"\", \"\", VLOOKUP(proj_id,ACTIVE_CPS!1:1048576,COLUMN(ACTIVE_CPS!S:S),0) )","v":{"$error":"#N/A"}},{"$f":"IF(VLOOKUP(proj_id,ACTIVE_CPS!1:1048576,COLUMN(ACTIVE_CPS!T:T),0) = \"\", \"\", VLOOKUP(proj_id,ACTIVE_CPS!1:1048576,COLUMN(ACTIVE_CPS!T:T),0) )","v":{"$error":"#N/A"}},{"$f":"VLOOKUP(proj_id,ACTIVE_CPS!1:1048576,COLUMN(ACTIVE_CPS!U:U),0)","v":{"$error":"#N/A"}},{"$f":"IF(VLOOKUP(proj_id,ACTIVE_CPS!1:1048576,COLUMN(ACTIVE_CPS!V:V),0) = \"\", \"\", VLOOKUP(proj_id,ACTIVE_CPS!1:1048576,COLUMN(ACTIVE_CPS!V:V),0) )","v":{"$error":"#N/A"}},{"$f":"IF(VLOOKUP(proj_id,ACTIVE_CPS!1:1048576,COLUMN(ACTIVE_CPS!W:W),0) = \"\", \"\", VLOOKUP(proj_id,ACTIVE_CPS!1:1048576,COLUMN(ACTIVE_CPS!W:W),0) )","v":{"$error":"#N/A"}},{"$f":"VLOOKUP(proj_id,ACTIVE_CPS!1:1048576,COLUMN(ACTIVE_CPS!X:X),0)","v":{"$error":"#N/A"}},{"$f":"IF(VLOOKUP(proj_id,ACTIVE_CPS!1:1048576,COLUMN(ACTIVE_CPS!Y:Y),0) = \"\", \"\", VLOOKUP(proj_id,ACTIVE_CPS!1:1048576,COLUMN(ACTIVE_CPS!Y:Y),0) )","v":{"$error":"#N/A"}},{"$f":"IF(VLOOKUP(proj_id,ACTIVE_CPS!1:1048576,COLUMN(ACTIVE_CPS!Z:Z),0) = \"\", \"\", VLOOKUP(proj_id,ACTIVE_CPS!1:1048576,COLUMN(ACTIVE_CPS!Z:Z),0) )","v":{"$error":"#N/A"}},{"$f":"VLOOKUP(proj_id,ACTIVE_CPS!1:1048576,COLUMN(ACTIVE_CPS!AA:AA),0)","v":{"$error":"#N/A"}}]

{"sheet":"ACTIVE_CPS","index":30,"n_rows":361,"n_cols":40,"rows_kept":361,"cut":false,"hidden":false,"merged":[]}
["PROJECT_NUMBER","PROJECT_NAME","STATUS","EST_COST","PLANNED_TOTAL","ACTUAL_TOTAL","PLANNING_PLANNED_START_DATE","PLANNING_PLANNED_END_DATE","PLANNING_PERCENT_COMPLETE","ESTIMATE_PLANNED_START_DATE","ESTIMATE_PLANNED_END_DATE","ESTIMATE_PERCENT_COMPLETE","DESIGN_PLANNED_START_DATE","DESIGN_PLANNED_END_DATE","DESIGN_PERCENT_COMPLETE","BID_PLANNED_START_DATE","BID_PLANNED_END_DATE","BID_PERCENT_COMPLETE","CONST_PLANNED_START_DATE","CONST_PLANNED_END_DATE","CONST_PERCENT_COMPLETE","OCCUP_PLANNED_START_DATE","OCCUP_PLANNED_END_DATE","OCCUP_PERCENT_COMPLETE","CLOSED_PLANNED_START_DATE","CLOSED_PLANNED_END_DATE","CLOSED_PERCENT_COMPLETE","PROJECT_MANAGER","CUSTOMER","ARCHITECT","INTERIOR_DESIGNER","LANDSCAPE_ARCHITECT","CIVIL_ENGINEER","MECHANICAL_ENGINEER","ELECTRICAL_ENGINEER","CONTRUCTION_REP","PROJECT_ADMIN","CONSULTANT","CONSTRUCTOR","DELIVERY_METHOD"]
["CP14358","KEDZIE HALL - ALTERATIONS TO ROOMS N331A AND N331B","IN DES","120,000",120000,0,null,null,null,null,null,null,"2017-08-24","2018-03-30",70,{"$f":"VLOOKUP(proj_id,ACTIVE_CPS!1:1048576,COLUMN(ACTIVE_CPS!J:J),0)","v":{"$error":"#N/A"}},null,null,"2018-05-14","2018-08-17",null,"2018-08-17","2019-05-17",null,"2019-05-17","2019-08-17",null,"CHARLANDB","THOMAS HARPSTEAD","CHARLANDB","LOCKWOODC","-","-","GOERGES","HALSEYG","LUTKENHOFFM",null,"IPF","IPF","IPF - IPF SELF-PERFORMED"]
["CP17240","FRIB - CRYOGENIC ASSEMBLY - CONSTRUCT ORIGINAL BUILDING","IN DES",null,null,null,null,null,null,null,null,null,null,null,null,null,null,null,null,null,null,null,null,null,null,null,null,"KOLPJ",null,"KOLPJ",null,null,null,null,null,null,null,null,null,"TBD - TO BE DETERMINED"]
["CP16110","PLANT AND SOIL SCIENCE  - ALTERATIONS TO ROOMS A398A AND A398B","RELCON","68,000",68000,60688,null,null,null,"2016-04-01","2016-05-16",null,null,null,null,null,null,null,"2016-09-28","2016-11-15",20,null,null,null,null,null,null,"O'BRIENI","LORRI BUSICK","-","-","-","-","-","-","-",null,"IPF","IPF","DB - DESIGN BUILD"]
["CP16203","COMMUNICATION ARTS - REPLACE ROOFS 1, 2, 3, 6, 7, 14 AND 15","OUTBID","2,200,000",2200000,20070,null,null,null,null,null,null,"2016-07-27","2018-01-31",100,"2017-10-20","2017-11-09",null,"2018-05-14","2018-08-17",null,"2018-08-17","2019-05-17",null,"2019-05-17","2019-08-17",null,"CHARLANDB","LYNDA BOOMER","CHARLANDB","-","KINNEYD","LEFEVREJ","-","-","GOTTSCHALKK","ROBIN MCVAY","ROOFING TECHNOLOGIES",null,"GC - DESIGN BID & BUILD"]
["CP13351","1855 PLACE - CONSTRUCT ORIGINAL BUILDINGS","SUBSTCOMP","156,700,000",156700000,138127265,null,null,null,null,null,null,"2014-01-01","2015-06-30",100,null,null,null,"2015-07-01","2017-07-31",97,"2017-08-31","2018-08-31",null,"2018-08-31","2019-01-30",null,"TEMPLER","BILL WHITBECK","TEMPLER","-","WILBERD","LEFEVREJ","FRANCISD","BEACHK","LINEBAUGHA","LAURIE BRINKER","KENNETH NEUMANN / JOEL SMITH & ASSOC INC","WALBRIDGE ALDINGER","CM - CONSTRUCTION MANAGER"]
["CP17253","MSU COLLEGE OF LAW - REPLACE FREIGHT ELEVATOR #3","IN DES","420,000",420000,0,null,null,null,null,null,null,"2017-12-18",null,null,null,null,null,null,null,null,null,null,null,null,null,null,"GOTTSCHALK","LYNDA BOOMER","KASDORFJ","-","-","-","-","HALSEYG","GOTTSCHALK","LAURIE BRINKER",null,null,"TBD - TO BE DETERMINED"]
["CP15051","KRESGE ART - DUST AND EXHAUST SYSTEM FOR WORK SPACES","RELCON","40,000",25000,17849,null,null,null,"2016-01-25","2016-03-10",100,"2016-03-01","2016-04-12",100,null,null,null,"2016-06-27","2016-07-18",97,"2016-07-18","2017-04-18",null,"2017-04-18","2017-07-18",null,"O'BRIENI","BRIAN KIRSCHENSTEINER","-","-","-","-","O'BRIENI","-","-",null,"DICLEMENTE SIEGEL DESIGN INC","IPF","DB - DESIGN BUILD"]
{"$rows_left_out":353}